{"text_format":"1","workbook":"xlsx","n_sheets":4,"sheets":["Introduction","A","C","Summary"],"not_rendered":{"charts":1,"images":1,"macros":1,"external_links":1,"defined_names":51,"comments":3,"pivot_tables":0},"unopened":[],"bounds":{"document_bytes":16777216,"sheet_cells":100000,"rows_first":2000,"rows_last":500,"rows_between":2000,"halvings":0,"cell_chars":16384,"cell_head_chars":4096},"cells_cut":0,"cells_raw":0,"read":"whole","date_system":"1900"}

{"sheet":"Introduction","index":0,"n_rows":60,"n_cols":15,"rows_kept":60,"cut":false,"hidden":false,"merged":[[0,8,1,20],[0,0,1,7]]}
["Crop Nutrient Response Tool (CNRT)"]
[]
[null,"This evaluation tool was designed to assist in interpretation and record-keeping for on-farm field crop trials involving multiple rates of any added nutrient."]
[null,"Its main goal is to provide the best possible estimate of \"optimum rate\" for a single-year response - the maximum rate at which it is profitable to apply a purchased nutrient - from limited data."]
[null,"The optimum rate is calculated without regard to residual effects on subsequent crops.  The analysis is therefore more useful for mobile nutrients like nitrogen and less applicable to soil-retained nutrients like phosphate and potash."]
[null,"It can also function as a record-keeping tool.  The summary worksheet provides a single-row storage for a thousand or more site-years."]
[null,"For best results, trials should have at least four rates, and one of them should be zero or less than 25% of the highest rate applied."]
[null,"MERNs are calculated from fitted curves without assessment of statistical significance.  The probability that they do not differ from zero is not calculated."]
[null,"Interpretation should NOT be based on calculated MERN alone.  It SHOULD include visual inspection of the relation of the fitted curve to the original data, and knowledge of data reliability."]
[null,"For computers without the Solver add-in, or if the \"Fit\" macro will not run, the response curves can be fit manually by tweaking the ABC coefficients for a good visual fit and maximum R-square."]
[null,"Note that cells with formulas are locked for protection.  Password to unprotect is \"ipni\"."]
[null,"Version 4.5 - May 2013 - assigns a weight of zero to the curve of lowest R-square, 1 to the curve with the highest, and intermediate weights to those in between"]
[]
[null,"Equation Form:",null,"R = price ratio (bushels of grain per pound of fertilizer nutrient); Y = Yield (bu/A); X = Rate of nutrient applied (lb/A)"]
[null,null,"Quadratic (Q):","Y = A + BX + CXX",null,null,null,null,null,null,"MERN = (R-B)/(2C) ",null,null,null,"A = intercept; B = initial slope; C = curvature"]
{"$rows_left_out":46}
{"sheet":"A","index":1,"n_rows":31,"n_cols":11,"rows_kept":31,"cut":false,"hidden":false,"merged":[[5,0,5,1],[4,0,4,1],[0,1,0,4],[1,2,3,2],[1,3,3,3],[1,0,1,1],[3,0,3,1],[2,0,2,1]]}
[null,"Crop Nutrient Response Tool (CNRT) v4.5",null,null,null,"R2-weighted Mean","Quadratic (Q)","Quadratic- Plateau (QP)","Mitscherlich (M)","Linear-Plateau (LP)","Spherical (SP)"]
["Step 1: Enter rate and yield data.",null,"Fertilizer rate, lb/A","Crop  Yield, bu/A","A:",null,91.97095386806113,91.127044066365428,188.87973582705112,94.166478869125314,91.670340047962398]
["Step 2: Click the Fit button.",null,null,null,"B:",null,1.0231882143594568,1.0842576349610928,-98.905342548977202,0.75000247812720344,87.801870836573073]
["Step 3: Adjust crop and fertilizer prices.",null,null,null,"C:",null,-2.8859185944194558E-3,-3.2915170856081667E-3,-1.4144778211619325E-2,179.99994931539214,143.35340968483089]
["Step 4: Click to append information to summary.",null,0,90,"R2:",null,{"$f":"IF(ISERROR(1-((SUM('C'!G5:G44)/COUNT('C'!G5:G44))/VAR($D5:$D44))),\"no data\",1-((SUM('C'!G5:G44)/COUNT('C'!G5:G44))/VAR($D5:$D44)))","v":0.99491709278790563},{"$f":"IF(ISERROR(1-((SUM('C'!H5:H44)/COUNT('C'!H5:H44))/VAR($D5:$D44))),\"no data\",1-((SUM('C'!H5:H44)/COUNT('C'!H5:H44))/VAR($D5:$D44)))","v":0.99633484686317153},{"$f":"IF(ISERROR(1-((SUM('C'!I5:I44)/COUNT('C'!I5:I44))/VAR($D5:$D44))),\"no data\",1-((SUM('C'!I5:I44)/COUNT('C'!I5:I44))/VAR($D5:$D44)))","v":0.99999408538407453},{"$f":"IF(ISERROR(1-((SUM('C'!J5:J44)/COUNT('C'!J5:J44))/VAR($D5:$D44))),\"no data\",1-((SUM('C'!J5:J44)/COUNT('C'!J5:J44))/VAR($D5:$D44)))","v":0.98296735214851783},{"$f":"IF(ISERROR(1-((SUM('C'!K5:K44)/COUNT('C'!K5:K44))/VAR($D5:$D44))),\"no data\",1-((SUM('C'!K5:K44)/COUNT('C'!K5:K44))/VAR($D5:$D44)))","v":0.99265003607507918}]
["Site Details",null,50,140,"MERN (lb/A):",{"$f":"IF('C'!M53,MAX('C'!J48:J298),\"NA\")","v":146.79114767721836},{"$f":"IF(AND(ISNUMBER(G5),ISNUMBER(B29),'C'!M53),MIN((1+0.1*G5)*MAX($C5:$C44),IF(G4<0,MAX((G3-B29)/(-2*G4),0),IF(G3>B29,MAX($C5:$C44),0))),\"NA$\")","v":155.530724258286},{"$f":"IF(AND(ISNUMBER(H5),ISNUMBER(B29),'C'!M53),MIN((1+0.1*H5)*MAX($C5:$C44),IF(H4<0,MAX((H3-B29)/(-2*H4),0),IF(H3>B29,MAX($C5:$C44),0))),\"NA$\")","v":145.64217865901068},{"$f":"IF(AND(ISNUMBER(I5),ISNUMBER(B29),'C'!M53),MIN((1+0.1*I5)*MAX($C5:$C44),MAX((1/I4)*LN(B29/(I3*I4)),0)),\"NA$\")","v":170.47147075601291},{"$f":"IF(AND(ISNUMBER(J5),ISNUMBER(B29),'C'!M53),MIN((1+0.1*J5)*MAX($C5:$C44),IF(J3>B29,(J4-J2)/J3,0)),\"NA$\")","v":114.44424911847975},{"$f":"IF(AND(ISNUMBER(K5),ISNUMBER(B29),'C'!M53),IF(ISNUMBER(SQRT(K4^2-2*B29*K4^3/(3*K3))),MIN((1+0.1*K5)*MAX($C5:$C44),SQRT(K4^2-2*B29*K4^3/(3*K3))),0),\"NA$\")","v":133.20369022940511}]
["Site",null,100,165,"Yield @ MERN (bu/A)",{"$f":"IF(ISNUMBER(F6),VLOOKUP(F6,'C'!B48:H298,7),\"NA\")","v":178.48314886593278},{"$f":"IF(ISNUMBER(G6),G2+G3*G6+G4*G6^2,\"NA\")","v":181.29834642569188},{"$f":"IF(ISNUMBER(H6),H2+H3*H6+H4*H6^2,\"NA\")","v":179.22219893666994},{"$f":"IF(ISNUMBER(I6),I2+I3*EXP(I6*I4),\"NA\")","v":180.00789674969135},{"$f":"IF(ISNUMBER(J6),IF(J3>'C'!O22,MIN(J4,J2+J3*J6),J2),\"NA\")","v":179.99994931539214},{"$f":"IF(AND(ISNUMBER(K6),K6>0),IF(K6<A!K$4,A!K$2+A!K$3*(3*K6/(2*A!K$4)-0.5*(K6/A!K$4)^3),A!K$3+A!K$2),\"NA\")","v":178.82757494661084}]
["Year",null,150,177,"Partial Factor Productivity (PFP), bu/lb",{"$f":"IF(ISNUMBER(F7/F6),F7/F6,\"NA\")","v":1.2158985857812252},1.1656754463807051,1.2305652152889002,1.0559414777815077,1.5728177754833716,1.3425121679334235]
["Town",null,200,183,"Agronomic Efficiency (AE), bu/lb",{"$f":"IF(ISNUMBER(F12/F6),F12/F6,\"NA\")","v":0.59561745417884293},{"$f":"IF(ISNUMBER((G7-G2)/G6),(G7-G2)/G6,\"NA\")","v":0.57433920521894422},{"$f":"IF(ISNUMBER((H7-H2)/H6),(H7-H2)/H6,\"NA\")","v":0.604873915519762},{"$f":"IF(ISNUMBER((I7-(I2+I3))/I6),(I7-(I2+I3))/I6,\"NA\")","v":0.52814411157675634},{"$f":"IF(ISNUMBER((J7-J2)/J6),(J7-J2)/J6,\"NA\")","v":0.75000247812720344},{"$f":"IF(ISNUMBER((K7-K2)/K6),(K7-K2)/K6,\"NA\")","v":0.6543154679014157}]
["County",null,null,null,"Estimated Partial N Balance (PNB), %",{"$f":"IF(AND(F6>0,ISNUMBER(F6)),F7*B$30/(F6+B$24),\"NA\")","v":0.79033408075779632},{"$f":"IF(AND(G6>0,ISNUMBER(G6)),G7*$B30/(G6+$B24),\"NA\")","v":0.7576890401474583},{"$f":"IF(AND(H6>0,ISNUMBER(H6)),H7*$B30/(H6+$B24),\"NA\")","v":0.79986738993778517},{"$f":"IF(AND(I6>0,ISNUMBER(I6)),I7*$B30/(I6+$B25),\"NA\")","v":0.68636196055798004},{"$f":"IF(AND(J6>0,ISNUMBER(J6)),J7*B30/(J6+B25),\"NA\")","v":1.0223315540641917},{"$f":"IF(AND(K6>0,ISNUMBER(K6)),K7*$B30/(K6+$B24),\"NA\")","v":0.87263290915672531}]
["State or province",null,null,null,"Estimated Recovery Efficiency (RE), %",{"$f":"IF(AND(F6>0,ISNUMBER(F6)),(F12/F6)*B$30*(1/B$31),\"NA\")","v":0.58130832615052241},{"$f":"IF(AND(G6>0,ISNUMBER(G6)),((G7-G2)*$B30*(1/$B31))/G6,\"NA\")","v":0.56054126635482537},{"$f":"IF(AND(H6>0,ISNUMBER(H6)),((H7-H2)*$B30*(1/$B31))/H6,\"NA\")","v":0.59034241004180976},{"$f":"IF(AND(I6>0,ISNUMBER(I6)),((I7-(I2+I3))*B30*(1/B31))/I6,\"NA\")","v":0.51545596475208955},{"$f":"IF(AND(J6>0,ISNUMBER(J6)),J3*B30*(1/B31),\"NA\")","v":0.73198440057459802},{"$f":"IF(AND(K6>0,ISNUMBER(K6)),((K7-K2)*$B30*(1/$B31))/K6,\"NA\")","v":0.63859617738126151}]
["Latitude",null,null,null,"Delta Yield (bu/A)",{"$f":"IF(ISNUMBER(F7),F7-VLOOKUP(0,'C'!B48:H298,7),\"NA\")","v":87.431369675495375},{"$f":"IF(ISNUMBER(G7),G7-G2,\"NA\")","v":89.327392557630745},{"$f":"IF(ISNUMBER(H7),H7-H2,\"NA\")","v":88.095154870304512},{"$f":"IF(ISNUMBER(I7),I7-(I2+I3),\"NA\")","v":90.033503471617436},{"$f":"IF(ISNUMBER(J7),J7-J2,\"NA\")","v":85.83347044626683},{"$f":"IF(ISNUMBER(K7),K7-K2,\"NA\")","v":87.15723489864844}]
["Longitude",null,null,null,"Relative Yield (%)",{"$f":"IF(ISNUMBER(F7),(F7-F12)/F7,\"NA\")","v":0.51014216058475492},{"$f":"IF(ISNUMBER(G7),G2/G7,\"NA\")","v":0.50729063822850118},{"$f":"IF(ISNUMBER(H7),H2/H7,\"NA\")","v":0.50845846444817999},{"$f":"IF(ISNUMBER(I7),(I2+I3)/I7,\"NA\")","v":0.49983581222098911},{"$f":"IF(ISNUMBER(J7),J2/J7,\"NA\")","v":0.52314725213688129},{"$f":"IF(ISNUMBER(K7),K2/K7,\"NA\")","v":0.5126185940581629}]
["Altitude"]
["Soil texture class",null,null,null,"My rate",154]
{"$rows_left_out":17}
{"sheet":"C","index":2,"n_rows":298,"n_cols":25,"rows_kept":298,"cut":false,"hidden":false,"merged":[[2,1,2,5],[2,6,2,10],[13,18,13,22],[5,13,5,17],[5,18,5,22],[0,11,2,23]]}
["Calculations worksheet - do not enter data here"]
[]
[null,"Predicted Curve Values",null,null,null,null,"Squared differences predicted less observed"]
["Obs","Q","QP","M","LP","S ","Q","QP","M","LP","S ",null,"Technical"]
[1,{"$f":"IF(ISNUMBER(A!C5),A!G$2+A!G$3*A!C5+A!G$4*A!C5^2,\"\")","v":91.97095386806113},{"$f":"IF(ISNUMBER(A!C5),IF(A!C5<(A!H$3/(-2*A!H$4)),A!H$2+A!H$3*A!C5+A!H$4*A!C5^2,A!H$2+A!H$3*(A!H$3/(-2*A!H$4))+A!H$4*(A!H$3/(-2*A!H$4))^2),\"\")","v":91.127044066365428},{"$f":"IF(ISNUMBER(A!C5),A!I$2+A!I$3*EXP(A!I$4*A!C5),\"\")","v":89.974393278073919},{"$f":"IF(ISNUMBER(A!C5),IF((A!J$2+A!J$3*A!C5)<A!J$4,A!J$2+A!J$3*A!C5,A!J$4),\"\")","v":94.166478869125314},{"$f":"IF(ISNUMBER(A!C5),IF(A!C5<A!K$4,A!K$2+A!K$3*(3*A!C5/(2*A!K$4)-0.5*(A!C5/A!K$4)^3),A!K$3+A!K$2),\"\")","v":91.670340047962398},{"$f":"IF(ISNUMBER(A!$C5),(B5-A!$D5)^2,\"\")","v":3.8846591500251311},{"$f":"IF(ISNUMBER(A!$C5),(C5-A!$D5)^2,\"\")","v":1.2702283275295203},{"$f":"IF(ISNUMBER(A!$C5),(D5-A!$D5)^2,\"\")","v":6.5570420779965672E-4},{"$f":"IF(ISNUMBER(A!$C5),(E5-A!$D5)^2,\"\")","v":17.359546166867752},{"$f":"IF(ISNUMBER(A!$C5),(F5-A!$D5)^2,\"\")","v":2.7900358758270261},null,null,"Constraints:"]
[{"$f":"A5+1","v":2},{"$f":"IF(ISNUMBER(A!C6),A!G$2+A!G$3*A!C6+A!G$4*A!C6^2,\"\")","v":135.91556809998534},{"$f":"IF(ISNUMBER(A!C6),IF(A!C6<(A!H$3/(-2*A!H$4)),A!H$2+A!H$3*A!C6+A!H$4*A!C6^2,A!H$2+A!H$3*(A!H$3/(-2*A!H$4))+A!H$4*(A!H$3/(-2*A!H$4))^2),\"\")","v":137.11113310039966},{"$f":"IF(ISNUMBER(A!C6),A!I$2+A!I$3*EXP(A!I$4*A!C6),\"\")","v":140.11905114982193},{"$f":"IF(ISNUMBER(A!C6),IF((A!J$2+A!J$3*A!C6)<A!J$4,A!J$2+A!J$3*A!C6,A!J$4),\"\")","v":131.6666027754855},{"$f":"IF(ISNUMBER(A!C6),IF(A!C6<A!K$4,A!K$2+A!K$3*(3*A!C6/(2*A!K$4)-0.5*(A!C6/A!K$4)^3),A!K$3+A!K$2),\"\")","v":135.7439732202476},{"$f":"IF(ISNUMBER(A!$C6),(B6-A!$D6)^2,\"\")","v":16.682583945857399},{"$f":"IF(ISNUMBER(A!$C6),(C6-A!$D6)^2,\"\")","v":8.345551963606507},{"$f":"IF(ISNUMBER(A!$C6),(D6-A!$D6)^2,\"\")","v":1.4173176273923145E-2},{"$f":"IF(ISNUMBER(A!$C6),(E6-A!$D6)^2,\"\")","v":69.445509301545954},{"$f":"IF(ISNUMBER(A!$C6),(F6-A!$D6)^2,\"\")","v":18.113763949969613},null,null,"Maximum",null,null,null,null,"Minimum",null,null,null,null,"Fitting"]
[{"$f":"A6+1","v":3},{"$f":"IF(ISNUMBER(A!C7),A!G$2+A!G$3*A!C7+A!G$4*A!C7^2,\"\")","v":165.43058935981225},{"$f":"IF(ISNUMBER(A!C7),IF(A!C7<(A!H$3/(-2*A!H$4)),A!H$2+A!H$3*A!C7+A!H$4*A!C7^2,A!H$2+A!H$3*(A!H$3/(-2*A!H$4))+A!H$4*(A!H$3/(-2*A!H$4))^2),\"\")","v":166.63763670639304},{"$f":"IF(ISNUMBER(A!C7),A!I$2+A!I$3*EXP(A!I$4*A!C7),\"\")","v":164.84054533524525},{"$f":"IF(ISNUMBER(A!C7),IF((A!J$2+A!J$3*A!C7)<A!J$4,A!J$2+A!J$3*A!C7,A!J$4),\"\")","v":169.16672668184566},{"$f":"IF(ISNUMBER(A!C7),IF(A!C7<A!K$4,A!K$2+A!K$3*(3*A!C7/(2*A!K$4)-0.5*(A!C7/A!K$4)^3),A!K$3+A!K$2),\"\")","v":168.64097428237176},{"$f":"IF(ISNUMBER(A!$C7),(B7-A!$D7)^2,\"\")","v":0.18540719678351919},{"$f":"IF(ISNUMBER(A!$C7),(C7-A!$D7)^2,\"\")","v":2.68185398212584},{"$f":"IF(ISNUMBER(A!$C7),(D7-A!$D7)^2,\"\")","v":2.5425790112048902E-2},{"$f":"IF(ISNUMBER(A!$C7),(E7-A!$D7)^2,\"\")","v":17.361611241204542},{"$f":"IF(ISNUMBER(A!$C7),(F7-A!$D7)^2,\"\")","v":13.256693724892537},null,null,"Q","QP","M","LP","S ","Q","QP","M","LP","S ","Tolerance"]
[4,{"$f":"IF(ISNUMBER(A!C8),A!G$2+A!G$3*A!C8+A!G$4*A!C8^2,\"\")","v":180.5160176475419},{"$f":"IF(ISNUMBER(A!C8),IF(A!C8<(A!H$3/(-2*A!H$4)),A!H$2+A!H$3*A!C8+A!H$4*A!C8^2,A!H$2+A!H$3*(A!H$3/(-2*A!H$4))+A!H$4*(A!H$3/(-2*A!H$4))^2),\"\")","v":179.70655488434562},{"$f":"IF(ISNUMBER(A!C8),A!I$2+A!I$3*EXP(A!I$4*A!C8),\"\")","v":177.02832965163302},{"$f":"IF(ISNUMBER(A!C8),IF((A!J$2+A!J$3*A!C8)<A!J$4,A!J$2+A!J$3*A!C8,A!J$4),\"\")","v":179.99994931539214},{"$f":"IF(ISNUMBER(A!C8),IF(A!C8<A!K$4,A!K$2+A!K$3*(3*A!C8/(2*A!K$4)-0.5*(A!C8/A!K$4)^3),A!K$3+A!K$2),\"\")","v":179.47221088453546},{"$f":"IF(ISNUMBER(A!$C8),(B8-A!$D8)^2,\"\")","v":12.362380097826081},{"$f":"IF(ISNUMBER(A!$C8),(C8-A!$D8)^2,\"\")","v":7.3254393419751391},{"$f":"IF(ISNUMBER(A!$C8),(D8-A!$D8)^2,\"\")","v":8.0256916164801067E-4},{"$f":"IF(ISNUMBER(A!$C8),(E8-A!$D8)^2,\"\")","v":8.9996958949217909},{"$f":"IF(ISNUMBER(A!$C8),(F8-A!$D8)^2,\"\")","v":6.1118266576155866},null,"A",{"$f":"(1+X8)*MIN(A!D5:D44)","v":135},{"$f":"N8","v":135},{"$f":"(1+X8)*MAX(A!D5:D44)","v":274.5},{"$f":"N8","v":135},{"$f":"N8","v":135},{"$f":"MAX((1-X8)*MIN(A!D5:D44)-(1+X8)*MIN(A!C5:C44)*(1/O20),0.5*MIN(A!D5:D44))","v":45},{"$f":"S8","v":45},{"$f":"(1-X8)*MAX(A!D5:D44)","v":91.5},{"$f":"S8","v":45},{"$f":"S8","v":45},0.5]
[5,{"$f":"IF(ISNUMBER(A!C9),A!G$2+A!G$3*A!C9+A!G$4*A!C9^2,\"\")","v":181.17185296317425},{"$f":"IF(ISNUMBER(A!C9),IF(A!C9<(A!H$3/(-2*A!H$4)),A!H$2+A!H$3*A!C9+A!H$4*A!C9^2,A!H$2+A!H$3*(A!H$3/(-2*A!H$4))+A!H$4*(A!H$3/(-2*A!H$4))^2),\"\")","v":180.41828792103669},{"$f":"IF(ISNUMBER(A!C9),A!I$2+A!I$3*EXP(A!I$4*A!C9),\"\")","v":183.03695054762937},{"$f":"IF(ISNUMBER(A!C9),IF((A!J$2+A!J$3*A!C9)<A!J$4,A!J$2+A!J$3*A!C9,A!J$4),\"\")","v":179.99994931539214},{"$f":"IF(ISNUMBER(A!C9),IF(A!C9<A!K$4,A!K$2+A!K$3*(3*A!C9/(2*A!K$4)-0.5*(A!C9/A!K$4)^3),A!K$3+A!K$2),\"\")","v":179.47221088453546},{"$f":"IF(ISNUMBER(A!$C9),(B9-A!$D9)^2,\"\")","v":3.3421215882547863},{"$f":"IF(ISNUMBER(A!$C9),(C9-A!$D9)^2,\"\")","v":6.6652372586650381},{"$f":"IF(ISNUMBER(A!$C9),(D9-A!$D9)^2,\"\")","v":1.3653429701106282E-3},{"$f":"IF(ISNUMBER(A!$C9),(E9-A!$D9)^2,\"\")","v":9.000304110216069},{"$f":"IF(ISNUMBER(A!$C9),(F9-A!$D9)^2,\"\")","v":12.445296043190103},null,"B",{"$f":"O21*(1+X9)/O20","v":1.5369230769230771},{"$f":"N9","v":1.5369230769230771},{"$f":"MIN(-0.0000001,N8-U8)","v":-9.9999999999999995E-8},{"$f":"O21*(1+0.5*X9)/O20","v":1.2807692307692307},{"$f":"-1*U9","v":138},0,0,{"$f":"S8-Q10","v":-138},{"$f":"S9","v":0},{"$f":"-1*P9","v":9.9999999999999995E-8},0.5]
[6,{"$f":"IF(ISNUMBER(A!C10),A!G$2+A!G$3*A!C10+A!G$4*A!C10^2,\"\")","v":""},{"$f":"IF(ISNUMBER(A!C10),IF(A!C10<(A!H$3/(-2*A!H$4)),A!H$2+A!H$3*A!C10+A!H$4*A!C10^2,A!H$2+A!H$3*(A!H$3/(-2*A!H$4))+A!H$4*(A!H$3/(-2*A!H$4))^2),\"\")","v":""},{"$f":"IF(ISNUMBER(A!C10),A!I$2+A!I$3*EXP(A!I$4*A!C10),\"\")","v":""},{"$f":"IF(ISNUMBER(A!C10),IF((A!J$2+A!J$3*A!C10)<A!J$4,A!J$2+A!J$3*A!C10,A!J$4),\"\")","v":""},{"$f":"IF(ISNUMBER(A!C10),IF(A!C10<A!K$4,A!K$2+A!K$3*(3*A!C10/(2*A!K$4)-0.5*(A!C10/A!K$4)^3),A!K$3+A!K$2),\"\")","v":""},{"$f":"IF(ISNUMBER(A!$C10),(B10-A!$D10)^2,\"\")","v":""},{"$f":"IF(ISNUMBER(A!$C10),(C10-A!$D10)^2,\"\")","v":""},{"$f":"IF(ISNUMBER(A!$C10),(D10-A!$D10)^2,\"\")","v":""},{"$f":"IF(ISNUMBER(A!$C10),(E10-A!$D10)^2,\"\")","v":""},{"$f":"IF(ISNUMBER(A!$C10),(F10-A!$D10)^2,\"\")","v":""},null,"C",-9.9999999999999995E-8,-9.9999999999999995E-8,-9.9999999999999995E-8,{"$f":"MAX(A!D5:D44)","v":183},{"$f":"M51","v":1255},-1,-1,{"$f":"(O21*(1+X10)/O20)/AVERAGE(P9,U9)","v":-1.9304347812098301E-2},{"$f":"(1-X8)*MAX(A!D5:D44)","v":91.5},0,0.3]
[7,{"$f":"IF(ISNUMBER(A!C11),A!G$2+A!G$3*A!C11+A!G$4*A!C11^2,\"\")","v":""},{"$f":"IF(ISNUMBER(A!C11),IF(A!C11<(A!H$3/(-2*A!H$4)),A!H$2+A!H$3*A!C11+A!H$4*A!C11^2,A!H$2+A!H$3*(A!H$3/(-2*A!H$4))+A!H$4*(A!H$3/(-2*A!H$4))^2),\"\")","v":""},{"$f":"IF(ISNUMBER(A!C11),A!I$2+A!I$3*EXP(A!I$4*A!C11),\"\")","v":""},{"$f":"IF(ISNUMBER(A!C11),IF((A!J$2+A!J$3*A!C11)<A!J$4,A!J$2+A!J$3*A!C11,A!J$4),\"\")","v":""},{"$f":"IF(ISNUMBER(A!C11),IF(A!C11<A!K$4,A!K$2+A!K$3*(3*A!C11/(2*A!K$4)-0.5*(A!C11/A!K$4)^3),A!K$3+A!K$2),\"\")","v":""},{"$f":"IF(ISNUMBER(A!$C11),(B11-A!$D11)^2,\"\")","v":""},{"$f":"IF(ISNUMBER(A!$C11),(C11-A!$D11)^2,\"\")","v":""},{"$f":"IF(ISNUMBER(A!$C11),(D11-A!$D11)^2,\"\")","v":""},{"$f":"IF(ISNUMBER(A!$C11),(E11-A!$D11)^2,\"\")","v":""},{"$f":"IF(ISNUMBER(A!$C11),(F11-A!$D11)^2,\"\")","v":""}]
[8,{"$f":"IF(ISNUMBER(A!C12),A!G$2+A!G$3*A!C12+A!G$4*A!C12^2,\"\")","v":""},{"$f":"IF(ISNUMBER(A!C12),IF(A!C12<(A!H$3/(-2*A!H$4)),A!H$2+A!H$3*A!C12+A!H$4*A!C12^2,A!H$2+A!H$3*(A!H$3/(-2*A!H$4))+A!H$4*(A!H$3/(-2*A!H$4))^2),\"\")","v":""},{"$f":"IF(ISNUMBER(A!C12),A!I$2+A!I$3*EXP(A!I$4*A!C12),\"\")","v":""},{"$f":"IF(ISNUMBER(A!C12),IF((A!J$2+A!J$3*A!C12)<A!J$4,A!J$2+A!J$3*A!C12,A!J$4),\"\")","v":""},{"$f":"IF(ISNUMBER(A!C12),IF(A!C12<A!K$4,A!K$2+A!K$3*(3*A!C12/(2*A!K$4)-0.5*(A!C12/A!K$4)^3),A!K$3+A!K$2),\"\")","v":""},{"$f":"IF(ISNUMBER(A!$C12),(B12-A!$D12)^2,\"\")","v":""},{"$f":"IF(ISNUMBER(A!$C12),(C12-A!$D12)^2,\"\")","v":""},{"$f":"IF(ISNUMBER(A!$C12),(D12-A!$D12)^2,\"\")","v":""},{"$f":"IF(ISNUMBER(A!$C12),(E12-A!$D12)^2,\"\")","v":""},{"$f":"IF(ISNUMBER(A!$C12),(F12-A!$D12)^2,\"\")","v":""}]
[9,{"$f":"IF(ISNUMBER(A!C13),A!G$2+A!G$3*A!C13+A!G$4*A!C13^2,\"\")","v":""},{"$f":"IF(ISNUMBER(A!C13),IF(A!C13<(A!H$3/(-2*A!H$4)),A!H$2+A!H$3*A!C13+A!H$4*A!C13^2,A!H$2+A!H$3*(A!H$3/(-2*A!H$4))+A!H$4*(A!H$3/(-2*A!H$4))^2),\"\")","v":""},{"$f":"IF(ISNUMBER(A!C13),A!I$2+A!I$3*EXP(A!I$4*A!C13),\"\")","v":""},{"$f":"IF(ISNUMBER(A!C13),IF((A!J$2+A!J$3*A!C13)<A!J$4,A!J$2+A!J$3*A!C13,A!J$4),\"\")","v":""},{"$f":"IF(ISNUMBER(A!C13),IF(A!C13<A!K$4,A!K$2+A!K$3*(3*A!C13/(2*A!K$4)-0.5*(A!C13/A!K$4)^3),A!K$3+A!K$2),\"\")","v":""},{"$f":"IF(ISNUMBER(A!$C13),(B13-A!$D13)^2,\"\")","v":""},{"$f":"IF(ISNUMBER(A!$C13),(C13-A!$D13)^2,\"\")","v":""},{"$f":"IF(ISNUMBER(A!$C13),(D13-A!$D13)^2,\"\")","v":""},{"$f":"IF(ISNUMBER(A!$C13),(E13-A!$D13)^2,\"\")","v":""},{"$f":"IF(ISNUMBER(A!$C13),(F13-A!$D13)^2,\"\")","v":""},null,null,"Data for Graph:"]
[10,{"$f":"IF(ISNUMBER(A!C14),A!G$2+A!G$3*A!C14+A!G$4*A!C14^2,\"\")","v":""},{"$f":"IF(ISNUMBER(A!C14),IF(A!C14<(A!H$3/(-2*A!H$4)),A!H$2+A!H$3*A!C14+A!H$4*A!C14^2,A!H$2+A!H$3*(A!H$3/(-2*A!H$4))+A!H$4*(A!H$3/(-2*A!H$4))^2),\"\")","v":""},{"$f":"IF(ISNUMBER(A!C14),A!I$2+A!I$3*EXP(A!I$4*A!C14),\"\")","v":""},{"$f":"IF(ISNUMBER(A!C14),IF((A!J$2+A!J$3*A!C14)<A!J$4,A!J$2+A!J$3*A!C14,A!J$4),\"\")","v":""},{"$f":"IF(ISNUMBER(A!C14),IF(A!C14<A!K$4,A!K$2+A!K$3*(3*A!C14/(2*A!K$4)-0.5*(A!C14/A!K$4)^3),A!K$3+A!K$2),\"\")","v":""},{"$f":"IF(ISNUMBER(A!$C14),(B14-A!$D14)^2,\"\")","v":""},{"$f":"IF(ISNUMBER(A!$C14),(C14-A!$D14)^2,\"\")","v":""},{"$f":"IF(ISNUMBER(A!$C14),(D14-A!$D14)^2,\"\")","v":""},{"$f":"IF(ISNUMBER(A!$C14),(E14-A!$D14)^2,\"\")","v":""},{"$f":"IF(ISNUMBER(A!$C14),(F14-A!$D14)^2,\"\")","v":""},null,null,"Most Economic Rate",null,null,null,null,"Yield at Most Economic Rate",null,null,null,null,"Mean","Mean"]
[11,{"$f":"IF(ISNUMBER(A!C15),A!G$2+A!G$3*A!C15+A!G$4*A!C15^2,\"\")","v":""},{"$f":"IF(ISNUMBER(A!C15),IF(A!C15<(A!H$3/(-2*A!H$4)),A!H$2+A!H$3*A!C15+A!H$4*A!C15^2,A!H$2+A!H$3*(A!H$3/(-2*A!H$4))+A!H$4*(A!H$3/(-2*A!H$4))^2),\"\")","v":""},{"$f":"IF(ISNUMBER(A!C15),A!I$2+A!I$3*EXP(A!I$4*A!C15),\"\")","v":""},{"$f":"IF(ISNUMBER(A!C15),IF((A!J$2+A!J$3*A!C15)<A!J$4,A!J$2+A!J$3*A!C15,A!J$4),\"\")","v":""},{"$f":"IF(ISNUMBER(A!C15),IF(A!C15<A!K$4,A!K$2+A!K$3*(3*A!C15/(2*A!K$4)-0.5*(A!C15/A!K$4)^3),A!K$3+A!K$2),\"\")","v":""},{"$f":"IF(ISNUMBER(A!$C15),(B15-A!$D15)^2,\"\")","v":""},{"$f":"IF(ISNUMBER(A!$C15),(C15-A!$D15)^2,\"\")","v":""},{"$f":"IF(ISNUMBER(A!$C15),(D15-A!$D15)^2,\"\")","v":""},{"$f":"IF(ISNUMBER(A!$C15),(E15-A!$D15)^2,\"\")","v":""},{"$f":"IF(ISNUMBER(A!$C15),(F15-A!$D15)^2,\"\")","v":""},null,null,"Q","QP","M","LP","S ","Q","QP","M","LP","S ","MERN","Y@mern"]
{"$rows_left_out":284}
{"sheet":"Summary","index":3,"n_rows":4,"n_cols":62,"rows_kept":4,"cut":false,"hidden":false,"merged":[[0,0,0,2],[0,4,1,5],[0,6,0,8]]}
["Summary - Multi-site-year Database",null,null,{"$f":"COUNTA(A5:A966)","v":0},null,null,"Current site-year is shown on row 4 - do not delete"]
[]
[{"$f":"A!A7","v":"Site"},{"$f":"A!A8","v":"Year"},{"$f":"A!A9","v":"Town"},{"$f":"A!A10","v":"County"},{"$f":"A!A11","v":"State or province"},{"$f":"A!A12","v":"Latitude"},{"$f":"A!A13","v":"Longitude"},{"$f":"A!A14","v":"Altitude"},{"$f":"A!A15","v":"Soil texture class"},{"$f":"A!A16","v":"Preceding crop"},{"$f":"A!A17","v":"Expected Yield (bu/A)"},{"$f":"A!A18","v":"Tillage"},{"$f":"A!A19","v":"Nutrient Source"},{"$f":"A!A20","v":"Nutrient Timing"},{"$f":"A!A21","v":"Nutrient Placement"},{"$f":"A!A22","v":"Planting date"},{"$f":"A!A23","v":"PSNT (ppm)"},{"$f":"A!A24","v":"Manure N (lb/A)"},{"$f":"A!A25","v":"Harvest date "},{"$f":"A!A26","v":"ESSENTIAL INFORMATION"},{"$f":"A!A27","v":"Crop ($/bu)"},{"$f":"A!A28","v":"Fertilizer ($/lb)"},{"$f":"A!A29","v":"Price ratio (f/c)"},{"$f":"A!A30","v":"Crop nutrient content (lb/bu)"},{"$f":"A!A31","v":"Nutrient harvest index"},{"$f":"A!A32","v":0},{"$f":"A!A33","v":0},{"$f":"A!A34","v":0},{"$f":"A!A35","v":0},{"$f":"A!A36","v":0},{"$f":"A!A37","v":0},{"$f":"A!A38","v":0},{"$f":"A!A39","v":0},{"$f":"A!A40","v":0},{"$f":"A!E6","v":"MERN (lb/A):"},{"$f":"A!E7","v":"Yield @ MERN (bu/A)"},"PFP","AEN","PNB","REN",{"$f":"A!E12","v":"Delta Yield (bu/A)"},{"$f":"A!E13","v":"Relative Yield (%)"},"QA","QB","QC","QPA","QPB","QPC","MA","MB","MC","LPA","LPB","LPC","SA","SB","SC","QR2","QPR2","MR2","LPR2","SR2"]
[{"$f":"A!B7","v":0},{"$f":"A!B8","v":0},{"$f":"A!B9","v":0},{"$f":"A!B10","v":0},{"$f":"A!B11","v":0},{"$f":"A!B12","v":0},{"$f":"A!B13","v":0},{"$f":"A!B14","v":0},{"$f":"A!B15","v":0},{"$f":"A!B16","v":0},{"$f":"A!B17","v":0},{"$f":"A!B18","v":0},{"$f":"A!B19","v":0},{"$f":"A!B20","v":0},{"$f":"A!B21","v":0},{"$f":"A!B22","v":0},{"$f":"A!B23","v":0},{"$f":"A!B24","v":0},{"$f":"A!B25","v":0},{"$f":"A!B26","v":0},{"$f":"A!B27","v":5.0999999999999996},{"$f":"A!B28","v":0.64},{"$f":"A!B29","v":0.12549019607843137},{"$f":"A!B30","v":0.65},{"$f":"A!B31","v":0.66600000000000004},{"$f":"A!B32","v":0},{"$f":"A!B33","v":0},{"$f":"A!B34","v":0},{"$f":"A!B35","v":0},{"$f":"A!B36","v":0},{"$f":"A!B37","v":0},{"$f":"A!B38","v":0},{"$f":"A!B39","v":0},{"$f":"A!B40","v":0},{"$f":"A!F6","v":146.79114767721836},{"$f":"A!F7","v":178.48314886593278},{"$f":"A!F8","v":1.2158985857812252},{"$f":"A!F9","v":0.59561745417884293},{"$f":"A!F10","v":0.79033408075779632},{"$f":"A!F11","v":0.58130832615052241},{"$f":"A!F12","v":87.431369675495375},{"$f":"A!F13","v":0.51014216058475492},{"$f":"A!G2","v":91.97095386806113},{"$f":"A!G3","v":1.0231882143594568},{"$f":"A!G4","v":-2.8859185944194558E-3},{"$f":"A!H2","v":91.127044066365428},{"$f":"A!H3","v":1.0842576349610928},{"$f":"A!H4","v":-3.2915170856081667E-3},{"$f":"A!I2","v":188.87973582705112},{"$f":"A!I3","v":-98.905342548977202},{"$f":"A!I4","v":-1.4144778211619325E-2},{"$f":"A!J2","v":94.166478869125314},{"$f":"A!J3","v":0.75000247812720344},{"$f":"A!J4","v":179.99994931539214},{"$f":"A!K2","v":91.670340047962398},{"$f":"A!K3","v":87.801870836573073},{"$f":"A!K4","v":143.35340968483089},{"$f":"A!G5","v":0.99491709278790563},{"$f":"A!H5","v":0.99633484686317153},{"$f":"A!I5","v":0.99999408538407453},{"$f":"A!J5","v":0.98296735214851783},{"$f":"A!K5","v":0.99265003607507918}]