{"text_format":"1","workbook":"xlsx","n_sheets":7,"sheets":["Introduction","E","A","B","C","D","Summary"],"not_rendered":{"charts":3,"images":1,"macros":1,"external_links":1,"defined_names":143,"comments":6,"pivot_tables":0},"unopened":[],"bounds":{"document_bytes":16777216,"sheet_cells":100000,"rows_first":2000,"rows_last":500,"rows_between":2000,"halvings":0,"cell_chars":16384,"cell_head_chars":4096},"cells_cut":0,"cells_raw":0,"read":"whole","date_system":"1900"}

{"sheet":"Introduction","index":0,"n_rows":60,"n_cols":15,"rows_kept":60,"cut":false,"hidden":false,"merged":[[0,8,1,20],[0,0,1,7]]}
["Crop Nutrient Response Tool (CNRT)"]
[]
[null,"This evaluation tool was designed to assist in interpretation and record-keeping for on-farm field crop trials involving multiple rates of any added nutrient."]
[null,"Its main goal is to provide the best possible estimate of \"optimum rate\" for a single-year response - the maximum rate at which it is profitable to apply a purchased nutrient - from limited data."]
[null,"The optimum rate is calculated without regard to residual effects on subsequent crops.  The analysis is therefore more useful for mobile nutrients like nitrogen and less applicable to soil-retained nutrients like phosphate and potash."]
[null,"It can also function as a record-keeping tool.  The summary worksheet provides a single-row storage for a thousand or more site-years."]
[null,"For best results, trials should have at least four rates, and one of them should be zero or less than 25% of the highest rate applied."]
[null,"MERNs are calculated from fitted curves without assessment of statistical significance.  The probability that they do not differ from zero is not calculated."]
{"$rows_left_out":53}
{"sheet":"E","index":1,"n_rows":31,"n_cols":9,"rows_kept":31,"cut":false,"hidden":false,"merged":[[4,0,4,1],[5,0,5,1],[1,3,3,3],[1,4,3,4],[0,7,0,8],[1,7,3,7],[1,8,3,8],[0,1,0,6],[1,0,1,1],[1,2,3,2],[1,5,3,5],[2,0,2,1],[3,0,3,1]]}
[null,"Crop Nutrient Response Tool (CNRT) v4.6 comparison mode",null,null,null,null,null,"R2-weighted Mean"]
["Step 1: Enter rate and yield data.",null,"Fertilizer rate, lb/A","Crop  Yield, bu/A","Fertilizer rate, lb/A","Crop  Yield, bu/A",null,"A","B"]
["Step 2: Click the Fit button."]
["Step 3: Adjust crop and fertilizer prices."]
["Step 4: Click to append information to summary.",null,0,40,0,75,"R2:",{"$f":"AVERAGE(A!G5:K5)","v":0.99621753678060654},{"$f":"AVERAGE(B!G5:K5)","v":0.99734085763688751}]
["Site Details",null,30,70,30,105,"MERN (lb/A):",{"$f":"A!F6","v":188.66010026437084},{"$f":"B!F6","v":165.75182996574563}]
["Site",null,90,120,90,155,"Yield @ MERN (bu/A)",{"$f":"A!F7","v":168.88919588507363},{"$f":"B!F7","v":188.30968546780824}]
["Year",null,120,140,120,175,"Partial Factor Productivity (PFP), bu/lb",{"$f":"A!F8","v":0.89520357324313893},{"$f":"B!F8","v":1.1360941565877398}]
{"$rows_left_out":24}
{"sheet":"A","index":2,"n_rows":44,"n_cols":11,"rows_kept":44,"cut":false,"hidden":false,"merged":[[5,0,5,1],[4,0,4,1],[0,1,0,4],[1,2,3,2],[1,3,3,3],[1,0,1,1],[3,0,3,1],[2,0,2,1]]}
[null,"Crop Nutrient Response Tool (CNRT) v4.5",null,null,null,"R2-weighted Mean","Quadratic (Q)","Quadratic- Plateau (QP)","Mitscherlich (M)","Linear-Plateau (LP)","Spherical (SP)"]
["Step 1: Enter rate and yield data.",null,"Fertilizer rate, lb/A","Crop  Yield, bu/A","A:",null,37.963117579006209,38.095868700180077,188.89754385871265,43.720956789283242,40.28930003735644]
["Step 2: Click the Fit button.",null,null,null,"B:",null,1.1840651338980446,1.1790377369235758,-151,0.79844829470802292,130.46065898838071]
["Step 3: Adjust crop and fertilizer prices.",null,null,null,"C:",null,-2.6191386982355948E-3,-2.5990970731378429E-3,-9.6666071438448672E-3,169.99984713439568,204.14134109102901]
["Step 4: Click to append information to summary.",null,{"$f":"IF(ISNUMBER(E!C5),E!C5,\"\")","v":0},{"$f":"IF(ISNUMBER(E!D5),E!D5,\"\")","v":40},"R2:",null,{"$f":"IF(ISERROR(1-((SUM('C'!G5:G44)/COUNT('C'!G5:G44))/VAR($D5:$D44))),\"no data\",1-((SUM('C'!G5:G44)/COUNT('C'!G5:G44))/VAR($D5:$D44)))","v":0.99739005912836309},{"$f":"IF(ISERROR(1-((SUM('C'!H5:H44)/COUNT('C'!H5:H44))/VAR($D5:$D44))),\"no data\",1-((SUM('C'!H5:H44)/COUNT('C'!H5:H44))/VAR($D5:$D44)))","v":0.99726803353471094},{"$f":"IF(ISERROR(1-((SUM('C'!I5:I44)/COUNT('C'!I5:I44))/VAR($D5:$D44))),\"no data\",1-((SUM('C'!I5:I44)/COUNT('C'!I5:I44))/VAR($D5:$D44)))","v":0.98989550984780417},{"$f":"IF(ISERROR(1-((SUM('C'!J5:J44)/COUNT('C'!J5:J44))/VAR($D5:$D44))),\"no data\",1-((SUM('C'!J5:J44)/COUNT('C'!J5:J44))/VAR($D5:$D44)))","v":0.99735726383531742},{"$f":"IF(ISERROR(1-((SUM('C'!K5:K44)/COUNT('C'!K5:K44))/VAR($D5:$D44))),\"no data\",1-((SUM('C'!K5:K44)/COUNT('C'!K5:K44))/VAR($D5:$D44)))","v":0.99917681755683629}]
["Site Details",null,{"$f":"IF(ISNUMBER(E!C6),E!C6,\"\")","v":30},{"$f":"IF(ISNUMBER(E!D6),E!D6,\"\")","v":70},"MERN (lb/A):",{"$f":"IF(AND(ISNUMBER(G5),ISNUMBER(B29),'C'!M53),(G6*'C'!B45+H6*'C'!C45+I6*'C'!D45+J6*'C'!E45+K6*'C'!F45)/SUM('C'!B45:'C'!F45),\"NA\")","v":188.66010026437084},{"$f":"IF(AND(ISNUMBER(G5),ISNUMBER(B29),'C'!M53),MIN((1+0.1*G5)*MAX($C5:$C44),IF(G4<0,MAX((G3-B29)/(-2*G4),0),IF(G3>B29,MAX($C5:$C44),0))),\"NA$\")","v":202.17813104198964},{"$f":"IF(AND(ISNUMBER(H5),ISNUMBER(B29),'C'!M53),MIN((1+0.1*H5)*MAX($C5:$C44),IF(H4<0,MAX((H3-B29)/(-2*H4),0),IF(H3>B29,MAX($C5:$C44),0))),\"NA$\")","v":202.76998266383623},{"$f":"IF(AND(ISNUMBER(I5),ISNUMBER(B29),'C'!M53),MIN((1+0.1*I5)*MAX($C5:$C44),MAX((1/I4)*LN(B29/(I3*I4)),0)),\"NA$\")","v":254.24054652346399},{"$f":"IF(AND(ISNUMBER(J5),ISNUMBER(B29),'C'!M53),MIN((1+0.1*J5)*MAX($C5:$C44),IF(J3>B29,(J4-J2)/J3,0)),\"NA$\")","v":158.15537609894977},{"$f":"IF(AND(ISNUMBER(K5),ISNUMBER(B29),'C'!M53),IF(ISNUMBER(SQRT(K4^2-2*B29*K4^3/(3*K3))),MIN((1+0.1*K5)*MAX($C5:$C44),SQRT(K4^2-2*B29*K4^3/(3*K3))),0),\"NA$\")","v":190.36683392031171}]
["Site",null,{"$f":"IF(ISNUMBER(E!C7),E!C7,\"\")","v":90},{"$f":"IF(ISNUMBER(E!D7),E!D7,\"\")","v":120},"Yield @ MERN (bu/A)",{"$f":"IF(ISNUMBER(F6),VLOOKUP(F6,'C'!B48:H298,7),\"NA\")","v":168.88919588507363},{"$f":"IF(ISNUMBER(G6),G2+G3*G6+G4*G6^2,\"NA\")","v":170.29528867087546},{"$f":"IF(ISNUMBER(H6),H2+H3*H6+H4*H6^2,\"NA\")","v":170.30572335467093},{"$f":"IF(ISNUMBER(I6),I2+I3*EXP(I6*I4),\"NA\")","v":175.96642975218845},{"$f":"IF(ISNUMBER(J6),IF(J3>'C'!O22,MIN(J4,J2+J3*J6),J2),\"NA\")","v":169.99984713439568},{"$f":"IF(AND(ISNUMBER(K6),K6>0),IF(K6<A!K$4,A!K$2+A!K$3*(3*K6/(2*A!K$4)-0.5*(K6/A!K$4)^3),A!K$3+A!K$2),\"NA\")","v":169.87903262350846}]
["Year",null,{"$f":"IF(ISNUMBER(E!C8),E!C8,\"\")","v":120},{"$f":"IF(ISNUMBER(E!D8),E!D8,\"\")","v":140},"Partial Factor Productivity (PFP), bu/lb",{"$f":"IF(ISNUMBER(F7/F6),F7/F6,\"NA\")","v":0.89520357324313893},0.84230320951729176,0.83989612820065962,0.69212575318291492,1.0748913589129934,0.89237725461474282]
{"$rows_left_out":37}
{"sheet":"B","index":3,"n_rows":44,"n_cols":11,"rows_kept":44,"cut":false,"hidden":false,"merged":[[4,0,4,1],[5,0,5,1],[0,1,0,4],[1,0,1,1],[1,2,3,2],[1,3,3,3],[2,0,2,1],[3,0,3,1]]}
[null,"Crop Nutrient Response Tool (CNRT) v4.5",null,null,null,"R2-weighted Mean","Quadratic (Q)","Quadratic- Plateau (QP)","Mitscherlich (M)","Linear-Plateau (LP)","Spherical (SP)"]
["Step 1: Enter rate and yield data.",null,"Fertilizer rate, lb/A","Crop  Yield, bu/A","A:",null,74.022463707304553,73.622648669414204,202.34342715548865,77.499943281723219,75.45471336981025]
["Step 2: Click the Fit button.",null,null,null,"B:",null,1.1704209529938847,1.1966104521114695,-130.65966426721383,0.83333355392007147,114.37870049789947]
["Step 3: Adjust crop and fertilizer prices.",null,null,null,"C:",null,-2.8944423906807652E-3,-3.0627098941284859E-3,-1.1898200737032589E-2,188.75000559732251,176.44204512166323]
["Step 4: Click to append information to summary.",null,{"$f":"IF(ISNUMBER(E!E5),E!E5,\"\")","v":0},{"$f":"IF(ISNUMBER(E!F5),E!F5,\"\")","v":75},"R2:",null,{"$f":"IF(ISERROR(1-((SUM(D!G5:G44)/COUNT(D!G5:G44))/VAR($D5:$D44))),\"no data\",1-((SUM(D!G5:G44)/COUNT(D!G5:G44))/VAR($D5:$D44)))","v":0.99923061351656572},{"$f":"IF(ISERROR(1-((SUM(D!H5:H44)/COUNT(D!H5:H44))/VAR($D5:$D44))),\"no data\",1-((SUM(D!H5:H44)/COUNT(D!H5:H44))/VAR($D5:$D44)))","v":0.99910978447342957},{"$f":"IF(ISERROR(1-((SUM(D!I5:I44)/COUNT(D!I5:I44))/VAR($D5:$D44))),\"no data\",1-((SUM(D!I5:I44)/COUNT(D!I5:I44))/VAR($D5:$D44)))","v":0.99157958874947971},{"$f":"IF(ISERROR(1-((SUM(D!J5:J44)/COUNT(D!J5:J44))/VAR($D5:$D44))),\"no data\",1-((SUM(D!J5:J44)/COUNT(D!J5:J44))/VAR($D5:$D44)))","v":0.99709894828331214},{"$f":"IF(ISERROR(1-((SUM(D!K5:K44)/COUNT(D!K5:K44))/VAR($D5:$D44))),\"no data\",1-((SUM(D!K5:K44)/COUNT(D!K5:K44))/VAR($D5:$D44)))","v":0.99968535316165019}]
["Site Details",null,{"$f":"IF(ISNUMBER(E!E6),E!E6,\"\")","v":30},{"$f":"IF(ISNUMBER(E!F6),E!F6,\"\")","v":105},"MERN (lb/A):",{"$f":"IF(AND(ISNUMBER(G5),ISNUMBER(B29),D!M53),(G6*D!B45+H6*D!C45+I6*D!D45+J6*D!E45+K6*D!F45)/SUM(D!B45:'D'!F45),\"NA\")","v":165.75182996574563},{"$f":"IF(AND(ISNUMBER(G5),ISNUMBER(B29),D!M53),MIN((1+0.1*G5)*MAX($C5:$C44),IF(G4<0,MAX((G3-B29)/(-2*G4),0),IF(G3>B29,MAX($C5:$C44),0))),\"NA$\")","v":180.5910797119034},{"$f":"IF(AND(ISNUMBER(H5),ISNUMBER(B29),D!M53),MIN((1+0.1*H5)*MAX($C5:$C44),IF(H4<0,MAX((H3-B29)/(-2*H4),0),IF(H3>B29,MAX($C5:$C44),0))),\"NA$\")","v":174.94481833977346},{"$f":"IF(AND(ISNUMBER(I5),ISNUMBER(B29),D!M53),MIN((1+0.1*I5)*MAX($C5:$C44),MAX((1/I4)*LN(B29/(I3*I4)),0)),\"NA$\")","v":211.85299092021617},{"$f":"IF(AND(ISNUMBER(J5),ISNUMBER(B29),D!M53),MIN((1+0.1*J5)*MAX($C5:$C44),IF(J3>B29,(J4-J2)/J3,0)),\"NA$\")","v":133.50003944071327},{"$f":"IF(AND(ISNUMBER(K5),ISNUMBER(B29),D!M53),IF(ISNUMBER(SQRT(K4^2-2*B29*K4^3/(3*K3))),MIN((1+0.1*K5)*MAX($C5:$C44),SQRT(K4^2-2*B29*K4^3/(3*K3))),0),\"NA$\")","v":164.71117098679085}]
["Site",null,{"$f":"IF(ISNUMBER(E!E7),E!E7,\"\")","v":90},{"$f":"IF(ISNUMBER(E!F7),E!F7,\"\")","v":155},"Yield @ MERN (bu/A)",{"$f":"IF(ISNUMBER(F6),VLOOKUP(F6,D!B48:H298,7),\"NA\")","v":188.30968546780824},{"$f":"IF(ISNUMBER(G6),G2+G3*G6+G4*G6^2,\"NA\")","v":190.99319799859882},{"$f":"IF(ISNUMBER(H6),H2+H3*H6+H4*H6^2,\"NA\")","v":189.22709889970764},{"$f":"IF(ISNUMBER(I6),I2+I3*EXP(I6*I4),\"NA\")","v":191.83763701438409},{"$f":"IF(ISNUMBER(J6),IF(J3>D!O22,MIN(J4,J2+J3*J6),J2),\"NA\")","v":188.75000559732251},{"$f":"IF(AND(ISNUMBER(K6),K6>0),IF(K6<B!K$4,B!K$2+B!K$3*(3*K6/(2*B!K$4)-0.5*(K6/B!K$4)^3),B!K$3+B!K$2),\"NA\")","v":189.09183054390306}]
["Year",null,{"$f":"IF(ISNUMBER(E!E8),E!E8,\"\")","v":120},{"$f":"IF(ISNUMBER(E!F8),E!F8,\"\")","v":175},"Partial Factor Productivity (PFP), bu/lb",{"$f":"IF(ISNUMBER(F7/F6),F7/F6,\"NA\")","v":1.1360941565877398},1.0576003992184437,1.0816387744174023,0.90552243884359473,1.4138573021257084,1.1480206801460202]
{"$rows_left_out":37}
{"sheet":"C","index":4,"n_rows":298,"n_cols":25,"rows_kept":298,"cut":false,"hidden":false,"merged":[[2,1,2,5],[2,6,2,10],[13,18,13,22],[5,13,5,17],[5,18,5,22],[0,11,2,23]]}
["Calculations worksheet - do not enter data here"]
[]
[null,"Predicted Curve Values",null,null,null,null,"Squared differences predicted less observed"]
["Obs","Q","QP","M","LP","S ","Q","QP","M","LP","S ",null,"Technical"]
[1,{"$f":"IF(ISNUMBER(A!C5),A!G$2+A!G$3*A!C5+A!G$4*A!C5^2,\"\")","v":37.963117579006209},{"$f":"IF(ISNUMBER(A!C5),IF(A!C5<(A!H$3/(-2*A!H$4)),A!H$2+A!H$3*A!C5+A!H$4*A!C5^2,A!H$2+A!H$3*(A!H$3/(-2*A!H$4))+A!H$4*(A!H$3/(-2*A!H$4))^2),\"\")","v":38.095868700180077},{"$f":"IF(ISNUMBER(A!C5),A!I$2+A!I$3*EXP(A!I$4*A!C5),\"\")","v":37.897543858712652},{"$f":"IF(ISNUMBER(A!C5),IF((A!J$2+A!J$3*A!C5)<A!J$4,A!J$2+A!J$3*A!C5,A!J$4),\"\")","v":43.720956789283242},{"$f":"IF(ISNUMBER(A!C5),IF(A!C5<A!K$4,A!K$2+A!K$3*(3*A!C5/(2*A!K$4)-0.5*(A!C5/A!K$4)^3),A!K$3+A!K$2),\"\")","v":40.28930003735644},{"$f":"IF(ISNUMBER(A!$C5),(B5-A!$D5)^2,\"\")","v":4.1488899969535282},{"$f":"IF(ISNUMBER(A!$C5),(C5-A!$D5)^2,\"\")","v":3.6257160069539101},{"$f":"IF(ISNUMBER(A!$C5),(D5-A!$D5)^2,\"\")","v":4.4203218260368855},{"$f":"IF(ISNUMBER(A!$C5),(E5-A!$D5)^2,\"\")","v":13.845519427713057},{"$f":"IF(ISNUMBER(A!$C5),(F5-A!$D5)^2,\"\")","v":8.3694511614437861E-2},null,null,"Constraints:"]
[{"$f":"A5+1","v":2},{"$f":"IF(ISNUMBER(A!C6),A!G$2+A!G$3*A!C6+A!G$4*A!C6^2,\"\")","v":71.127846767535516},{"$f":"IF(ISNUMBER(A!C6),IF(A!C6<(A!H$3/(-2*A!H$4)),A!H$2+A!H$3*A!C6+A!H$4*A!C6^2,A!H$2+A!H$3*(A!H$3/(-2*A!H$4))+A!H$4*(A!H$3/(-2*A!H$4))^2),\"\")","v":71.127813442063299},{"$f":"IF(ISNUMBER(A!C6),A!I$2+A!I$3*EXP(A!I$4*A!C6),\"\")","v":75.909543393590923},{"$f":"IF(ISNUMBER(A!C6),IF((A!J$2+A!J$3*A!C6)<A!J$4,A!J$2+A!J$3*A!C6,A!J$4),\"\")","v":67.674405630523921},{"$f":"IF(ISNUMBER(A!C6),IF(A!C6<A!K$4,A!K$2+A!K$3*(3*A!C6/(2*A!K$4)-0.5*(A!C6/A!K$4)^3),A!K$3+A!K$2),\"\")","v":68.840437649275088},{"$f":"IF(ISNUMBER(A!$C6),(B6-A!$D6)^2,\"\")","v":1.2720383310403121},{"$f":"IF(ISNUMBER(A!$C6),(C6-A!$D6)^2,\"\")","v":1.2719631600986674},{"$f":"IF(ISNUMBER(A!$C6),(D6-A!$D6)^2,\"\")","v":34.92270312073412},{"$f":"IF(ISNUMBER(A!$C6),(E6-A!$D6)^2,\"\")","v":5.4083891713388406},{"$f":"IF(ISNUMBER(A!$C6),(F6-A!$D6)^2,\"\")","v":1.3445848452186828},null,null,"Maximum",null,null,null,null,"Minimum",null,null,null,null,"Fitting"]
[{"$f":"A6+1","v":3},{"$f":"IF(ISNUMBER(A!C7),A!G$2+A!G$3*A!C7+A!G$4*A!C7^2,\"\")","v":123.3139561741219},{"$f":"IF(ISNUMBER(A!C7),IF(A!C7<(A!H$3/(-2*A!H$4)),A!H$2+A!H$3*A!C7+A!H$4*A!C7^2,A!H$2+A!H$3*(A!H$3/(-2*A!H$4))+A!H$4*(A!H$3/(-2*A!H$4))^2),\"\")","v":123.15657873088537},{"$f":"IF(ISNUMBER(A!C7),A!I$2+A!I$3*EXP(A!I$4*A!C7),\"\")","v":125.63552102515685},{"$f":"IF(ISNUMBER(A!C7),IF((A!J$2+A!J$3*A!C7)<A!J$4,A!J$2+A!J$3*A!C7,A!J$4),\"\")","v":115.58130331300529},{"$f":"IF(ISNUMBER(A!C7),IF(A!C7<A!K$4,A!K$2+A!K$3*(3*A!C7/(2*A!K$4)-0.5*(A!C7/A!K$4)^3),A!K$3+A!K$2),\"\")","v":120.97413972907347},{"$f":"IF(ISNUMBER(A!$C7),(B7-A!$D7)^2,\"\")","v":10.982305524000649},{"$f":"IF(ISNUMBER(A!$C7),(C7-A!$D7)^2,\"\")","v":9.9639892842779023},{"$f":"IF(ISNUMBER(A!$C7),(D7-A!$D7)^2,\"\")","v":31.759097224984892},{"$f":"IF(ISNUMBER(A!$C7),(E7-A!$D7)^2,\"\")","v":19.524880411658},{"$f":"IF(ISNUMBER(A!$C7),(F7-A!$D7)^2,\"\")","v":0.94894821175933552},null,null,"Q","QP","M","LP","S ","Q","QP","M","LP","S ","Tolerance"]
[4,{"$f":"IF(ISNUMBER(A!C8),A!G$2+A!G$3*A!C8+A!G$4*A!C8^2,\"\")","v":142.33533639217899},{"$f":"IF(ISNUMBER(A!C8),IF(A!C8<(A!H$3/(-2*A!H$4)),A!H$2+A!H$3*A!C8+A!H$4*A!C8^2,A!H$2+A!H$3*(A!H$3/(-2*A!H$4))+A!H$4*(A!H$3/(-2*A!H$4))^2),\"\")","v":142.15339927782426},{"$f":"IF(ISNUMBER(A!C8),A!I$2+A!I$3*EXP(A!I$4*A!C8),\"\")","v":141.56079243260442},{"$f":"IF(ISNUMBER(A!C8),IF((A!J$2+A!J$3*A!C8)<A!J$4,A!J$2+A!J$3*A!C8,A!J$4),\"\")","v":139.53475215424598},{"$f":"IF(ISNUMBER(A!C8),IF(A!C8<A!K$4,A!K$2+A!K$3*(3*A!C8/(2*A!K$4)-0.5*(A!C8/A!K$4)^3),A!K$3+A!K$2),\"\")","v":142.07241762493376},{"$f":"IF(ISNUMBER(A!$C8),(B8-A!$D8)^2,\"\")","v":5.4537960646355712},{"$f":"IF(ISNUMBER(A!$C8),(C8-A!$D8)^2,\"\")","v":4.6371284497340595},{"$f":"IF(ISNUMBER(A!$C8),(D8-A!$D8)^2,\"\")","v":2.4360730176752092},{"$f":"IF(ISNUMBER(A!$C8),(E8-A!$D8)^2,\"\")","v":0.21645555797875754},{"$f":"IF(ISNUMBER(A!$C8),(F8-A!$D8)^2,\"\")","v":4.2949148121361},null,"A",{"$f":"(1+X8)*MIN(A!D5:D44)","v":60},{"$f":"N8","v":60},{"$f":"(1+X8)*MAX(A!D5:D44)","v":256.5},{"$f":"N8","v":60},{"$f":"N8","v":60},{"$f":"MAX((1-X8)*MIN(A!D5:D44)-(1+X8)*MIN(A!C5:C44)*(1/O20),0.5*MIN(A!D5:D44))","v":20},{"$f":"S8","v":20},{"$f":"(1-X8)*MAX(A!D5:D44)","v":85.5},{"$f":"S8","v":20},{"$f":"S8","v":20},0.5]
{"$rows_left_out":291}
{"sheet":"D","index":5,"n_rows":298,"n_cols":25,"rows_kept":298,"cut":false,"hidden":false,"merged":[[13,18,13,22],[0,11,2,23],[2,1,2,5],[2,6,2,10],[5,13,5,17],[5,18,5,22]]}
["Calculations worksheet - do not enter data here"]
[]
[null,"Predicted Curve Values",null,null,null,null,"Squared differences predicted less observed"]
["Obs","Q","QP","M","LP","S ","Q","QP","M","LP","S ",null,"Technical"]
[1,{"$f":"IF(ISNUMBER(B!C5),B!G$2+B!G$3*B!C5+B!G$4*B!C5^2,\"\")","v":74.022463707304553},{"$f":"IF(ISNUMBER(B!C5),IF(B!C5<(B!H$3/(-2*B!H$4)),B!H$2+B!H$3*B!C5+B!H$4*B!C5^2,B!H$2+B!H$3*(B!H$3/(-2*B!H$4))+B!H$4*(B!H$3/(-2*B!H$4))^2),\"\")","v":73.622648669414204},{"$f":"IF(ISNUMBER(B!C5),B!I$2+B!I$3*EXP(B!I$4*B!C5),\"\")","v":71.683762888274828},{"$f":"IF(ISNUMBER(B!C5),IF((B!J$2+B!J$3*B!C5)<B!J$4,B!J$2+B!J$3*B!C5,B!J$4),\"\")","v":77.499943281723219},{"$f":"IF(ISNUMBER(B!C5),IF(B!C5<B!K$4,B!K$2+B!K$3*(3*B!C5/(2*B!K$4)-0.5*(B!C5/B!K$4)^3),B!K$3+B!K$2),\"\")","v":75.45471336981025},{"$f":"IF(ISNUMBER(B!$C5),(B5-B!$D5)^2,\"\")","v":0.95557720353675901},{"$f":"IF(ISNUMBER(B!$C5),(C5-B!$D5)^2,\"\")","v":1.8970966878664628},{"$f":"IF(ISNUMBER(B!$C5),(D5-B!$D5)^2,\"\")","v":10.997428581183312},{"$f":"IF(ISNUMBER(B!$C5),(E5-B!$D5)^2,\"\")","v":6.2497164118330577},{"$f":"IF(ISNUMBER(B!$C5),(F5-B!$D5)^2,\"\")","v":0.20676424868419307},null,null,"Constraints:"]
[{"$f":"A5+1","v":2},{"$f":"IF(ISNUMBER(B!C6),B!G$2+B!G$3*B!C6+B!G$4*B!C6^2,\"\")","v":106.5300941455084},{"$f":"IF(ISNUMBER(B!C6),IF(B!C6<(B!H$3/(-2*B!H$4)),B!H$2+B!H$3*B!C6+B!H$4*B!C6^2,B!H$2+B!H$3*(B!H$3/(-2*B!H$4))+B!H$4*(B!H$3/(-2*B!H$4))^2),\"\")","v":106.76452332804266},{"$f":"IF(ISNUMBER(B!C6),B!I$2+B!I$3*EXP(B!I$4*B!C6),\"\")","v":110.90645209636601},{"$f":"IF(ISNUMBER(B!C6),IF((B!J$2+B!J$3*B!C6)<B!J$4,B!J$2+B!J$3*B!C6,B!J$4),\"\")","v":102.49994989932536},{"$f":"IF(ISNUMBER(B!C6),IF(B!C6<B!K$4,B!K$2+B!K$3*(3*B!C6/(2*B!K$4)-0.5*(B!C6/B!K$4)^3),B!K$3+B!K$2),\"\")","v":104.34489262806039},{"$f":"IF(ISNUMBER(B!$C6),(B6-B!$D6)^2,\"\")","v":2.3411880941190808},{"$f":"IF(ISNUMBER(B!$C6),(C6-B!$D6)^2,\"\")","v":3.1135425752067327},{"$f":"IF(ISNUMBER(B!$C6),(D6-B!$D6)^2,\"\")","v":34.886176366666433},{"$f":"IF(ISNUMBER(B!$C6),(E6-B!$D6)^2,\"\")","v":6.2502505058832867},{"$f":"IF(ISNUMBER(B!$C6),(F6-B!$D6)^2,\"\")","v":0.42916566876961887},null,null,"Maximum",null,null,null,null,"Minimum",null,null,null,null,"Fitting"]
[{"$f":"A6+1","v":3},{"$f":"IF(ISNUMBER(B!C7),B!G$2+B!G$3*B!C7+B!G$4*B!C7^2,\"\")","v":155.91536611223998},{"$f":"IF(ISNUMBER(B!C7),IF(B!C7<(B!H$3/(-2*B!H$4)),B!H$2+B!H$3*B!C7+B!H$4*B!C7^2,B!H$2+B!H$3*(B!H$3/(-2*B!H$4))+B!H$4*(B!H$3/(-2*B!H$4))^2),\"\")","v":156.50963921700571},{"$f":"IF(ISNUMBER(B!C7),B!I$2+B!I$3*EXP(B!I$4*B!C7),\"\")","v":157.56359362970593},{"$f":"IF(ISNUMBER(B!C7),IF((B!J$2+B!J$3*B!C7)<B!J$4,B!J$2+B!J$3*B!C7,B!J$4),\"\")","v":152.49996313452965},{"$f":"IF(ISNUMBER(B!C7),IF(B!C7<B!K$4,B!K$2+B!K$3*(3*B!C7/(2*B!K$4)-0.5*(B!C7/B!K$4)^3),B!K$3+B!K$2),\"\")","v":155.37866734283739},{"$f":"IF(ISNUMBER(B!$C7),(B7-B!$D7)^2,\"\")","v":0.83789511943733508},{"$f":"IF(ISNUMBER(B!$C7),(C7-B!$D7)^2,\"\")","v":2.279010565521622},{"$f":"IF(ISNUMBER(B!$C7),(D7-B!$D7)^2,\"\")","v":6.5720122982688478},{"$f":"IF(ISNUMBER(B!$C7),(E7-B!$D7)^2,\"\")","v":6.2501843287108096},{"$f":"IF(ISNUMBER(B!$C7),(F7-B!$D7)^2,\"\")","v":0.14338895653152853},null,null,"Q","QP","M","LP","S ","Q","QP","M","LP","S ","Tolerance"]
[4,{"$f":"IF(ISNUMBER(B!C8),B!G$2+B!G$3*B!C8+B!G$4*B!C8^2,\"\")","v":172.79300764076768},{"$f":"IF(ISNUMBER(B!C8),IF(B!C8<(B!H$3/(-2*B!H$4)),B!H$2+B!H$3*B!C8+B!H$4*B!C8^2,B!H$2+B!H$3*(B!H$3/(-2*B!H$4))+B!H$4*(B!H$3/(-2*B!H$4))^2),\"\")","v":173.11288044734039},{"$f":"IF(ISNUMBER(B!C8),B!I$2+B!I$3*EXP(B!I$4*B!C8),\"\")","v":171.00603972064209},{"$f":"IF(ISNUMBER(B!C8),IF((B!J$2+B!J$3*B!C8)<B!J$4,B!J$2+B!J$3*B!C8,B!J$4),\"\")","v":177.49996975213179},{"$f":"IF(ISNUMBER(B!C8),IF(B!C8<B!K$4,B!K$2+B!K$3*(3*B!C8/(2*B!K$4)-0.5*(B!C8/B!K$4)^3),B!K$3+B!K$2),\"\")","v":174.14897089850257},{"$f":"IF(ISNUMBER(B!$C8),(B8-B!$D8)^2,\"\")","v":4.8708152737098258},{"$f":"IF(ISNUMBER(B!$C8),(C8-B!$D8)^2,\"\")","v":3.5612202060302161},{"$f":"IF(ISNUMBER(B!$C8),(D8-B!$D8)^2,\"\")","v":15.95171871308869},{"$f":"IF(ISNUMBER(B!$C8),(E8-B!$D8)^2,\"\")","v":6.2498487615738831},{"$f":"IF(ISNUMBER(B!$C8),(F8-B!$D8)^2,\"\")","v":0.72425053159552533},null,"A",{"$f":"(1+X8)*MIN(B!D5:D44)","v":112.5},{"$f":"N8","v":112.5},{"$f":"(1+X8)*MAX(B!D5:D44)","v":286.5},{"$f":"N8","v":112.5},{"$f":"N8","v":112.5},{"$f":"MAX((1-X8)*MIN(B!D5:D44)-(1+X8)*MIN(B!C5:C44)*(1/O20),0.5*MIN(B!D5:D44))","v":37.5},{"$f":"S8","v":37.5},{"$f":"(1-X8)*MAX(B!D5:D44)","v":95.5},{"$f":"S8","v":37.5},{"$f":"S8","v":37.5},0.5]
{"$rows_left_out":291}
{"sheet":"Summary","index":6,"n_rows":5,"n_cols":62,"rows_kept":5,"cut":false,"hidden":false,"merged":[[0,0,0,2],[0,4,1,5],[0,6,0,8]]}
["Summary - Multi-site-year Database",null,null,{"$f":"COUNTA(A5:A966)","v":1},null,null,"Current site-year is shown on row 4 - do not delete"]
[]
[{"$f":"A!A7","v":"Site"},{"$f":"A!A8","v":"Year"},{"$f":"A!A9","v":"Town"},{"$f":"A!A10","v":"County"},{"$f":"A!A11","v":"State or province"},{"$f":"A!A12","v":"Latitude"},{"$f":"A!A13","v":"Longitude"},{"$f":"A!A14","v":"Altitude"},{"$f":"A!A15","v":"Soil texture class"},{"$f":"A!A16","v":"Preceding crop"},{"$f":"A!A17","v":"Expected Yield (bu/A)"},{"$f":"A!A18","v":"Tillage"},{"$f":"A!A19","v":"Nutrient Source"},{"$f":"A!A20","v":"Nutrient Timing"},{"$f":"A!A21","v":"Nutrient Placement"},{"$f":"A!A22","v":"Planting date"},{"$f":"A!A23","v":"PSNT (ppm)"},{"$f":"A!A24","v":"Manure N (lb/A)"},{"$f":"A!A25","v":"Harvest date "},{"$f":"A!A26","v":"ESSENTIAL INFORMATION"},{"$f":"A!A27","v":"Crop ($/bu)"},{"$f":"A!A28","v":"Fertilizer ($/lb)"},{"$f":"A!A29","v":"Price ratio (f/c)"},{"$f":"A!A30","v":"Crop nutrient content (lb/bu)"},{"$f":"A!A31","v":"Nutrient harvest index"},{"$f":"A!A32","v":0},{"$f":"A!A33","v":0},{"$f":"A!A34","v":0},{"$f":"A!A35","v":0},{"$f":"A!A36","v":0},{"$f":"A!A37","v":0},{"$f":"A!A38","v":0},{"$f":"A!A39","v":0},{"$f":"A!A40","v":0},{"$f":"A!E6","v":"MERN (lb/A):"},{"$f":"A!E7","v":"Yield @ MERN (bu/A)"},"PFP","AEN","PNB","REN",{"$f":"A!E12","v":"Delta Yield (bu/A)"},{"$f":"A!E13","v":"Relative Yield (%)"},"QA","QB","QC","QPA","QPB","QPC","MA","MB","MC","LPA","LPB","LPC","SA","SB","SC","QR2","QPR2","MR2","LPR2","SR2"]
[{"$f":"A!B7","v":0},{"$f":"A!B8","v":0},{"$f":"A!B9","v":0},{"$f":"A!B10","v":0},{"$f":"A!B11","v":0},{"$f":"A!B12","v":0},{"$f":"A!B13","v":0},{"$f":"A!B14","v":0},{"$f":"A!B15","v":0},{"$f":"A!B16","v":0},{"$f":"A!B17","v":0},{"$f":"A!B18","v":0},{"$f":"A!B19","v":0},{"$f":"A!B20","v":0},{"$f":"A!B21","v":0},{"$f":"A!B22","v":0},{"$f":"A!B23","v":0},{"$f":"A!B24","v":0},{"$f":"A!B25","v":0},{"$f":"A!B26","v":0},{"$f":"A!B27","v":4},{"$f":"A!B28","v":0.5},{"$f":"A!B29","v":0.125},{"$f":"A!B30","v":0.65},{"$f":"A!B31","v":0.66600000000000004},{"$f":"A!B32","v":0},{"$f":"A!B33","v":0},{"$f":"A!B34","v":0},{"$f":"A!B35","v":0},{"$f":"A!B36","v":0},{"$f":"A!B37","v":0},{"$f":"A!B38","v":0},{"$f":"A!B39","v":0},{"$f":"A!B40","v":0},{"$f":"A!F6","v":188.66010026437084},{"$f":"A!F7","v":168.88919588507363},{"$f":"A!F8","v":0.89520357324313893},{"$f":"A!F9","v":0.68302641889471705},{"$f":"A!F10","v":0.58188232260804029},{"$f":"A!F11","v":0.66661737579814717},{"$f":"A!F12","v":128.85983267189147},{"$f":"A!F13","v":0.23701553556108765},{"$f":"A!G2","v":37.963117579006209},{"$f":"A!G3","v":1.1840651338980446},{"$f":"A!G4","v":-2.6191386982355948E-3},{"$f":"A!H2","v":38.095868700180077},{"$f":"A!H3","v":1.1790377369235758},{"$f":"A!H4","v":-2.5990970731378429E-3},{"$f":"A!I2","v":188.89754385871265},{"$f":"A!I3","v":-151},{"$f":"A!I4","v":-9.6666071438448672E-3},{"$f":"A!J2","v":43.720956789283242},{"$f":"A!J3","v":0.79844829470802292},{"$f":"A!J4","v":169.99984713439568},{"$f":"A!K2","v":40.28930003735644},{"$f":"A!K3","v":130.46065898838071},{"$f":"A!K4","v":204.14134109102901},{"$f":"A!G5","v":0.99739005912836309},{"$f":"A!H5","v":0.99726803353471094},{"$f":"A!I5","v":0.98989550984780417},{"$f":"A!J5","v":0.99735726383531742},{"$f":"A!K5","v":0.99917681755683629}]
[0,0,0,0,0,0,0,0,0,0,0,0,0,0,0,0,0,0,0,0,6,0.6,9.9999999999999992E-2,0.65,0.66600000000000004,0,0,0,0,0,0,0,0,0,170.38539689284809,177.96315441232005,1.044474219373609,0.6011285987474615,0.67890824259284588,0.58668707084962457,102.42353488122785,0.42446774884690813,72.727521248358059,1.0889706653938125,-2.7732541634254656E-3,72.933545088498477,1.0825138933864182,-2.742536036542341E-3,198.32574001294248,-129.22705643053197,-1.0453138882461405E-2,79.999852821337754,0.750002094154396,177.33332586052416,78.260426805058913,101.14488988222689,183.21750346259904,0.98927250995258742,0.98924526921339573,0.98324128674383426,0.98603907210464348,0.9908111904627166]